Error compiling BIND 9.2.2.rc1 on Solaris 9

Error compiling BIND 9.2.2.rc1 on Solaris 9

Post by Vikr » Sat, 25 Jan 2003 02:04:55



I am trying to compile BIND 9.2.2rc1 on Solaris 9. The ./configure and
make steps went fine without any problems. The make install step fail
with the following error.

making install in /tmp/bind-9.2.2rc1/lib/bind/port/solaris/include
make[2]: Entering directory
`/tmp/bind-9.2.2rc1/lib/bind/port/solaris/include'
/bin/bash ../mkinstalldirs
/tmp/bind-9.2.2_pkg/usr/local/bind/include/sys
../mkinstalldirs: ../mkinstalldirs: No such file or directory
make[2]: *** [installdirs] Error 127
make[2]: Leaving directory
`/tmp/bind-9.2.2rc1/lib/bind/port/solaris/include'
make[1]: *** [install] Error 1
make[1]: Leaving directory `/tmp/bind-9.2.2rc1/lib/bind'
make: *** [install] Error 1

Would appreciate any help to resolve the issue.

Regards,
Vikram

 
 
 

1. Check Point Firewall-1 dropping return Bind 9.2.2.rc1 dns packets

We are experiencing problems related to bind 9.2.2.rc1 and
checkpoint firewall-1.

Some of the return dns packets are being partially dropped at the
firewall for a reason unknown to me, others are allowed to pass as expected.
Our firewall admin is telling me that checkpoint is dropping on rule 0, as
if it is no longer in the state table.

When using dig to lookup hostnames against a bind 9 server the initial
request times out but then another immediate request of the same address
shows that the data has been cached, and thus the requested is returned.

If the timeout value used with dig is increased (say to 60) this will all so
produce the desired result.

We only see this problem with the bind 9 servers in the environment.
Machines running queries against bind 4 servers do not suffer this fate.

Can anyone offer suggests to fix or work around this
problem? Thanks.

2. ISDN simulator vendor recommendations

3. IOS release 12.2S for the Catalyst 4500 series

4. Realtek 8029 Driver

5. BIND 4.9.2 Compile on Solaris 2.3 - Compile Errors HELP!

6. Palm OS 3.5 (the color os)

7. Compiling errors for BIND 8.2.2 P5 on Solaris 2.6 with GCC

8. BIND 8.2.2P5 compile errors on Solaris 2.6

9. errors compiling ppp-2.4.1 on solaris 8 and on solaris 8 x86

10. HELP - Bind Compile Error ( Bind 8.2.2-P5 / Slackware 7.1 / Ker 2.2.16 / Chroot )

11. Compiling BIND 8.2.2P5 on Intel machine w/ Solaris 8

12. Compiling bind 9 (9.1.1rc5) on Solaris 7, 64 bit static binaries (doens't work)