Gimp 1.1.12 compilation problem

Gimp 1.1.12 compilation problem

Post by Christophe MICHE » Fri, 14 Jan 2000 04:00:00



hello all

        I have a big problem in compiling/installing the Gimp version 1.1.12
(and by the way all previous versions except installing the 1.0.4
version in RPMmdk format.

my system:

        Linux Mandrake 6.1
        GTK 1.2.3mdk installed and working (for all applications except the
gimp)

the problem:

        When running the ./configure script, I have an error message saying
that the GTK is not correctly installed whereas it obviously is, in the
form of a RPM package.
here is the config.log file below:

------------ begin of config.log ----------------------

configure:624: checking for a BSD compatible install
configure:677: checking whether build environment is sane
configure:734: checking whether make sets ${MAKE}
configure:773: checking for working aclocal
configure:786: checking for working autoconf
configure:799: checking for working automake
configure:812: checking for working autoheader
configure:825: checking for working makeinfo
configure:919: checking host system type
configure:940: checking build system type
configure:960: checking for ranlib
configure:990: checking for gcc
configure:1103: checking whether the C compiler (gcc  ) works
configure:1119: gcc -o conftest    conftest.c  1>&5
configure:1145: checking whether the C compiler (gcc  ) is a
cross-compiler
configure:1150: checking whether we are using GNU C
configure:1178: checking whether gcc accepts -g
configure:1221: checking for ld used by GCC
configure:1284: checking if the linker (/usr/bin/ld) is GNU ld
configure:1300: checking for BSD-compatible nm
configure:1337: checking whether ln -s works
ltconfig:603: checking for object suffix
ltconfig:604: gcc -c -g -O2  conftest.c 1>&5
ltconfig:776: checking if gcc PIC flag -fPIC works
ltconfig:777: gcc -c -g -O2 -fPIC -DPIC  conftest.c 1>&5
ltconfig:829: checking if gcc supports -c -o file.o
ltconfig:830: gcc -c -g -O2 -o out/conftest2.o  conftest.c 1>&5
ltconfig:862: checking if gcc supports -c -o file.lo
ltconfig:863: gcc -c -g -O2 -c -o conftest.lo  conftest.c 1>&5
ltconfig:914: checking if gcc supports -fno-rtti -fno-exceptions
ltconfig:915: gcc -c -g -O2 -fno-rtti -fno-exceptions -c conftest.c
conftest.c 1>&5
ltconfig:958: checking if gcc static flag -static works
ltconfig:959: gcc -o conftest -g -O2   -static conftest.c  1>&5
GNU ld version 2.9.1 (with BFD 2.9.1.0.25)
ltconfig:1592: checking if global_symbol_pipe works
ltconfig:1593: gcc -c -g -O2  conftest.c 1>&5
ltconfig:1596: eval "/usr/bin/nm -B conftest.o | sed -n -e 's/^.*[
]\([ABCDGISTW]\)[       ][      ]*\(\)\([_A-Za-z][_A-Za-z0-9]*\)$/\1 \2\3 \3/p' >
conftest.nm"
ltconfig:1648: gcc -o conftest -g -O2 -fno-builtin -fno-rtti
-fno-exceptions   conftest.c conftstm.o 1>&5
configure:1518: checking whether to enable maintainer-specific portions
of Makefiles
configure:1548: checking host system type
configure:1572: checking for gcc
configure:1685: checking whether the C compiler (gcc -g -O2 ) works
configure:1701: gcc -o conftest -g -O2   conftest.c  1>&5
configure:1727: checking whether the C compiler (gcc -g -O2 ) is a
cross-compiler
configure:1732: checking whether we are using GNU C
configure:1760: checking whether gcc accepts -g
configure:1792: checking for POSIXized ISC
configure:1816: checking for gcc option to accept ANSI C
configure:1869: gcc  -c -g -O2  conftest.c 1>&5
configure:1904: checking for a BSD compatible install
configure:1957: checking whether ln -s works
configure:1978: checking whether make sets ${MAKE}
configure:2005: checking how to run the C preprocessor
configure:2026: gcc -E  conftest.c >/dev/null 2>conftest.out
configure:2127: checking for ANSI C header files
configure:2140: gcc -E  conftest.c >/dev/null 2>conftest.out
configure:2207: gcc -o conftest -g -O2   conftest.c  1>&5
configure:2231: checking for working const
configure:2285: gcc -c -g -O2  conftest.c 1>&5
configure:2306: checking for inline
configure:2320: gcc -c -g -O2  conftest.c 1>&5
configure:2346: checking for off_t
configure:2379: checking for size_t
configure:2414: checking for working alloca.h
configure:2426: gcc -o conftest -g -O2   conftest.c  1>&5
configure:2447: checking for alloca
configure:2480: gcc -o conftest -g -O2   conftest.c  1>&5
configure:2649: checking for unistd.h
configure:2659: gcc -E  conftest.c >/dev/null 2>conftest.out
configure:2688: checking for getpagesize
configure:2716: gcc -o conftest -g -O2   conftest.c  1>&5
configure:2741: checking for working mmap
configure:2889: gcc -o conftest -g -O2   conftest.c  1>&5
configure:2917: checking for argz.h
configure:2927: gcc -E  conftest.c >/dev/null 2>conftest.out
In file included from /usr/include/errno.h:36,
                 from /usr/include/argz.h:26,
                 from configure:2923:
/usr/include/bits/errno.h:25: linux/errno.h: No such file or directory
configure: failed program was:
#line 2922 "configure"
#include "confdefs.h"
#include <argz.h>
configure:2917: checking for limits.h
configure:2927: gcc -E  conftest.c >/dev/null 2>conftest.out
In file included from /usr/include/bits/posix1_lim.h:126,
                 from /usr/include/limits.h:30,
                 from
/usr/lib/gcc-lib/i686-pc-linux-gnu/pgcc-2.91.66/include/limits.h:117,
                 from
/usr/lib/gcc-lib/i686-pc-linux-gnu/pgcc-2.91.66/include/syslimits.h:7,
                 from
/usr/lib/gcc-lib/i686-pc-linux-gnu/pgcc-2.91.66/include/limits.h:11,
                 from configure:2923:
/usr/include/bits/local_lim.h:27: linux/limits.h: No such file or
directory
configure: failed program was:
#line 2922 "configure"
#include "confdefs.h"
#include <limits.h>
configure:2917: checking for locale.h
configure:2927: gcc -E  conftest.c >/dev/null 2>conftest.out
configure:2917: checking for nl_types.h
configure:2927: gcc -E  conftest.c >/dev/null 2>conftest.out
configure:2917: checking for malloc.h
configure:2927: gcc -E  conftest.c >/dev/null 2>conftest.out
configure:2917: checking for string.h
configure:2927: gcc -E  conftest.c >/dev/null 2>conftest.out
configure:2917: checking for unistd.h
configure:2917: checking for sys/param.h
configure:2927: gcc -E  conftest.c >/dev/null 2>conftest.out
In file included from /usr/include/bits/posix1_lim.h:126,
                 from /usr/include/limits.h:30,
                 from
/usr/lib/gcc-lib/i686-pc-linux-gnu/pgcc-2.91.66/include/limits.h:117,
                 from
/usr/lib/gcc-lib/i686-pc-linux-gnu/pgcc-2.91.66/include/syslimits.h:7,
                 from
/usr/lib/gcc-lib/i686-pc-linux-gnu/pgcc-2.91.66/include/limits.h:11,
                 from /usr/include/sys/param.h:23,
                 from configure:2923:
/usr/include/bits/local_lim.h:27: linux/limits.h: No such file or
directory
In file included from configure:2923:
/usr/include/sys/param.h:24: linux/limits.h: No such file or directory
/usr/include/sys/param.h:25: linux/param.h: No such file or directory
configure: failed program was:
#line 2922 "configure"
#include "confdefs.h"
#include <sys/param.h>
configure:2957: checking for getcwd
configure:2985: gcc -o conftest -g -O2   conftest.c  1>&5
configure:2957: checking for munmap
configure:2985: gcc -o conftest -g -O2   conftest.c  1>&5
configure:2957: checking for putenv
configure:2985: gcc -o conftest -g -O2   conftest.c  1>&5
configure:2957: checking for setenv
configure:2985: gcc -o conftest -g -O2   conftest.c  1>&5
configure:2957: checking for setlocale
configure:2985: gcc -o conftest -g -O2   conftest.c  1>&5
configure:2957: checking for strchr
configure:2985: gcc -o conftest -g -O2   conftest.c  1>&5
configure:2957: checking for strcasecmp
configure:2985: gcc -o conftest -g -O2   conftest.c  1>&5
configure:2957: checking for strdup
configure:2985: gcc -o conftest -g -O2   conftest.c  1>&5
configure:2957: checking for __argz_count
configure:2985: gcc -o conftest -g -O2   conftest.c  1>&5
configure:2957: checking for __argz_stringify
configure:2985: gcc -o conftest -g -O2   conftest.c  1>&5
configure:2957: checking for __argz_next
configure:2985: gcc -o conftest -g -O2   conftest.c  1>&5
configure:3014: checking for stpcpy
configure:3042: gcc -o conftest -g -O2   conftest.c  1>&5
configure:3076: checking for LC_MESSAGES
configure:3088: gcc -o conftest -g -O2   conftest.c  1>&5
configure:3109: checking whether NLS is requested
configure:3129: checking whether included gettext is requested
configure:3148: checking for libintl.h
configure:3158: gcc -E  conftest.c >/dev/null 2>conftest.out
configure:3175: checking for gettext in libc
configure:3187: gcc -o conftest -g -O2   conftest.c  1>&5
configure:3301: checking for msgfmt
configure:3335: checking for dcgettext
configure:3363: gcc -o conftest -g -O2   conftest.c  1>&5
configure:3390: checking for gmsgfmt
configure:3426: checking for xgettext
configure:3466: gcc -o conftest -g -O2   conftest.c  1>&5
configure:3924: checking for catalogs to be installed
configure:4077: checking for gtk-config
configure:4112: checking for GTK - version >= 1.2.1
configure:4213: gcc -o conftest -g -O2 -I/usr/X11R6/include
-I/usr/lib/glib/include   conftest.c -L/usr/lib -L/usr/X11R6/lib -lgtk
-lgdk -rdynamic -lgmodule -lglib -ldl -lXext -lX11 -lm  1>&5
In file included from /usr/include/bits/posix1_lim.h:126,
                 from /usr/include/limits.h:30,
                 from
/usr/lib/gcc-lib/i686-pc-linux-gnu/pgcc-2.91.66/include/limits.h:117,
                 from
/usr/lib/gcc-lib/i686-pc-linux-gnu/pgcc-2.91.66/include/syslimits.h:7,
                 from
/usr/lib/gcc-lib/i686-pc-linux-gnu/pgcc-2.91.66/include/limits.h:11,
                 from /usr/lib/glib/include/glibconfig.h:13,
                 from /usr/include/glib.h:66,
                 from /usr/include/gdk/gdktypes.h:33,
                 from /usr/include/gdk/gdk.h:31,
                 from /usr/include/gtk/gtk.h:31,
                 from configure:4137:
/usr/include/bits/local_lim.h:27: linux/limits.h: No such file or
directory
configure: failed program was:
#line 4135 "configure"
#include "confdefs.h"

#include <gtk/gtk.h>
#include <stdio.h>
#include <stdlib.h>

int
main ()
{
...

read more »

 
 
 

Gimp 1.1.12 compilation problem

Post by Zach Bea » Fri, 14 Jan 2000 04:00:00


[snip]
Quote:>the problem:

>    When running the ./configure script, I have an error message saying
>that the GTK is not correctly installed whereas it obviously is, in the
>form of a RPM package.
>here is the config.log file below:

>------------ begin of config.log ----------------------
[snip]
>configure:4112: checking for GTK - version >= 1.2.1
>configure:4213: gcc -o conftest -g -O2 -I/usr/X11R6/include
>-I/usr/lib/glib/include   conftest.c -L/usr/lib -L/usr/X11R6/lib -lgtk
>-lgdk -rdynamic -lgmodule -lglib -ldl -lXext -lX11 -lm  1>&5
>In file included from /usr/include/bits/posix1_lim.h:126,
>                 from /usr/include/limits.h:30,
>                 from
>/usr/lib/gcc-lib/i686-pc-linux-gnu/pgcc-2.91.66/include/limits.h:117,
>                 from
>/usr/lib/gcc-lib/i686-pc-linux-gnu/pgcc-2.91.66/include/syslimits.h:7,
>                 from
>/usr/lib/gcc-lib/i686-pc-linux-gnu/pgcc-2.91.66/include/limits.h:11,
>                 from /usr/lib/glib/include/glibconfig.h:13,
>                 from /usr/include/glib.h:66,
>                 from /usr/include/gdk/gdktypes.h:33,
>                 from /usr/include/gdk/gdk.h:31,
>                 from /usr/include/gtk/gtk.h:31,
>                 from configure:4137:
>/usr/include/bits/local_lim.h:27: linux/limits.h: No such file or
>directory

[snip]

You need to install the Linux kernel source, or at least the kernel headers,
for this to compile. Also, you should probably use a more recent version of
GIMP, such as 1.1.14 or the soon-to-be-released 1.1.15.

Zach
--

PGP mail welcome.   http://www.xach.com/pgpkey.txt

 
 
 

Gimp 1.1.12 compilation problem

Post by Mart » Fri, 14 Jan 2000 04:00:00


> You need to install the Linux kernel source, or at least the kernel headers,
> for this to compile. Also, you should probably use a more recent version of
> GIMP, such as 1.1.14 or the soon-to-be-released 1.1.15.

> Zach
> --

> PGP mail welcome.   http://www.xach.com/pgpkey.txt

Zachary,
I would to thank you for this post. I have been struggling to compile
xsane as a plugin to gimp for some time now. I recognized some similar
error messages and installed the above. Often us newbies don't know the
right question to ask. Needless to say I'm scanning directly into gimp
and I'm very happy.

Thanks Again,
Marty

 
 
 

1. gimp-1.3.15 compilation problem

Hello,

Since about gimp-1.3.11 I haven't been able to compile new versions.  
The latest one ends with the following message when linking:

mkdir .libs
gcc -g -O2 -Wall -o .libs/gimp-1.3 app_procs.o main.o batch.o errors.o libgimp_glue.o -Wl,--export-dynamic -Wl,--export-dynamic -Wl,--export-dynamic  config/libappconfig.a gui/libappgui.a display/libappdisplay.a tools/libapptools.a widgets/libappwidgets.a core/libappcore.a pdb/libapppdb.a paint/libapppaint.a text/libapptext.a xcf/libappxcf.a vectors/libappvectors.a file/libappfile.a plug-in/libappplug-in.a paint-funcs/libapppaint-funcs.a base/libappbase.a ../libgimpcolor/.libs/libgimpcolor-1.3.so ../libgim
pmath/.libs/libgimpmath-1.3.so ../libgimpbase/.libs/libgimpbase-1.3.so ../libgimpmodule/.libs/libgimpmodule-1.3.so /cd-img/src/gimp-1.3.15/libgimpbase/.libs/libgimpbase-1.3.so ../libgimpwidgets/.libs/libgimpwidgets-1.3.so /cd-img/src/gimp-1.3.15/libgimpcolor/.libs/libgimpcolor-1.3.so /usr/lib/libgtk-x11-2.0.so /usr/lib/libgdk-x11-2.0.so /usr/lib/libatk-1.0.so /usr/lib/libgdk_pixbuf-2.0.so /usr/lib/libpangox-1.0.so /usr/lib/libpangoft2-1.0.so /usr/lib/libpango-1.0.so /usr/lib/libgobject-2.0.so /usr/lib/libg
module-2.0.so -ldl /usr/lib/libglib-2.0.so /usr/lib/libart_lgpl_2.so -lm /usr/lib/libfontconfig.so /usr/lib/libfreetype.so -lz /usr/lib/libexpat.so
/usr/bin/ld: Dwarf Error: Invalid or unhandled FORM value: 14.
gui/libappgui.a(plug-in-menus.o):/cd-img/src/gimp-1.3.15/app/gui/plug-in-menus.c:78: undefined reference to `bind_textdomain_codeset'
gui/libappgui.a(plug-in-menus.o):/cd-img/src/gimp-1.3.15/app/gui/plug-in-menus.c:107: undefined reference to `bind_textdomain_codeset'
collect2: ld returned 1 exit status
make[3]: *** [gimp-1.3] Error 1
make[3]: Leaving directory `/cd-img/src/gimp-1.3.15/app'
make[2]: *** [all-recursive] Error 1
make[2]: Leaving directory `/cd-img/src/gimp-1.3.15/app'
make[1]: *** [all-recursive] Error 1
make[1]: Leaving directory `/cd-img/src/gimp-1.3.15'
make: *** [all] Error 2

Any ideas?

-- Juergen

--
Juergen Koslowski               If I don't see you no more on this world
ITI, TU Braunschweig               I'll meet you on the next one

http://www.iti.cs.tu-bs.de/~koslowj      Jimi Hendrix (Voodoo Child, SR)

2. WTB: Lightwave any version

3. GIMP compilation problem - Perl

4. What pixar uses ???

5. gimp compilation problem

6. ID3DXSkinMesh coordinates

7. Gimp-1.1.13; problems at compilation

8. Showcase image conversions

9. Gimp-1.1.13 - Compilation problems

10. GIMP Compilation Woes....

11. Problem with gimp-path-set-points and gimp-path-stroke-current

12. POV Compilation problem under Irix 6.2

13. xfpovray compilation problems