Cyrus SASL Compile Error

Cyrus SASL Compile Error

Post by Manue » Sun, 11 May 2003 17:45:32



** Don't flame me if this is in the wrong newsgroup. ***

** Not sure where I should post this question **

Hope someone can help me out. I need this program for my sendmail SMTP AUTH.

I have compiled this same program on another box (Slack 9.0, kernel 2.4.20)
and it works but on this box (Slack 8.0, kernel 2.2.19), there was an error.

It says cannot find this file "krb.h". Seach the entire hard disk, cannot
find it. Even on my Slack 9.0 (which compiled fine), I still cannot find it.

tried both (with prefix or without prefix)
./configure --enable-login
or
./configure --prefix=/usr --enable-login

this error occur when I was doing a "make"
Error Message
************
make all-recursive
make[1]: Entering directory `/usr/local/cyrus-sasl-1.5.28'
Making all in include
make[2]: Entering directory `/usr/local/cyrus-sasl-1.5.28/include'
make[2]: Nothing to be done for `all'.
make[2]: Leaving directory `/usr/local/cyrus-sasl-1.5.28/include'
Making all in lib
make[2]: Entering directory `/usr/local/cyrus-sasl-1.5.28/lib'
/bin/sh ../libtool --mode=compile
gcc -DHAVE_CONFIG_H -I. -I. -I.. -I../include -I/usr/local/include -Wall -W
-g -O2 -c checkpw.c
gcc -DHAVE_CONFIG_H -I. -I. -I.. -I../include -I/usr/local/include -Wall -W
-g -O2 -c checkpw.c -fPIC -DPIC -o checkpw.lo
checkpw.c:63: krb.h: No such file or directory
make[2]: *** [checkpw.lo] Error 1
make[2]: Leaving directory `/usr/local/cyrus-sasl-1.5.28/lib'
make[1]: *** [all-recursive] Error 1
make[1]: Leaving directory `/usr/local/cyrus-sasl-1.5.28'
make: *** [all-recursive-am] Error 2

 
 
 

Cyrus SASL Compile Error

Post by armin wallan » Sun, 11 May 2003 22:06:05



> ** Don't flame me if this is in the wrong newsgroup. ***

> ** Not sure where I should post this question **

> Hope someone can help me out. I need this program for my sendmail SMTP AUTH.

> I have compiled this same program on another box (Slack 9.0, kernel 2.4.20)
> and it works but on this box (Slack 8.0, kernel 2.2.19), there was an error.

> It says cannot find this file "krb.h". Seach the entire hard disk, cannot
> find it. Even on my Slack 9.0 (which compiled fine), I still cannot find it.

i don't know about slackware but in debian you would install either of
these 2 packages:

libkrb5-dev
kerberos4kth-dev

hth, armin

--

life, the universe and everything
http://www.dtch.org

 
 
 

1. solaris 9 / cyrus imap sasl compile problems

Greetings,

I am wondering if anyone has been able to successfully get cyrus imap
running under solaris 9. I'm having a whole lot of trouble getting
this to compile.. each step closer I get, it fails on something new. I
have the latest cyrus imap, sasl, openssl and berkeleydb installed. I
want to use cyrus sasl for authentication. Cyrus sasl did compile and
install, but I'm not convinced I did a successful job of it.

I apologize for not posting specific errors. This is driving me crazy
and I need to get some fresh air. I'm hoping that if someone HAS has
success with this, they will please email me directly and hopefully
lend a helping hand.

Thanks for your time and any support!

Reece

2. Installing new sci devices

3. Compiling cyrus-sasl

4. Xwindows; virtual window size; minicom

5. Compiling Cyrus SASL 1.5.27 on Solaris 8

6. LOCKUPS !!!! HELP !!!!

7. Cyrus-SASL compile problem

8. Sound over X to another machine?

9. Cyrus SASL will not compile on Solaris 8

10. building error for Cyrus SASL

11. Problems with Heimdal, OpenLDAP, Cyrus SASL, GSSAPI, and Active Directory

12. cyrus-sasl installation help

13. cyrus-sasl and ld