1.1.1 kdebase compile problem

1. kdebase compile problem

I just tried compiling kdebase-1.1 and I had problems building the
kfmclient.  I've installed kdelibs and kdesupport with no problems
(well - I had to symlink libjpeg.so.6a to libjpeg.so).

Any suggestions would be great,
Vic.

My error is:

# make
make all-recursive
make[1]: Entering directory `/home/v2ng/kde/kdebase-1.1'
Making all in kcheckpass
make[2]: Entering directory `/home/v2ng/kde/kdebase-1.1/kcheckpass'
make[2]: Nothing to be done for `all'.
make[2]: Leaving directory `/home/v2ng/kde/kdebase-1.1/kcheckpass'
Making all in kfm
make[2]: Entering directory `/home/v2ng/kde/kdebase-1.1/kfm'
Making all in kfmwarn
make[3]: Entering directory `/home/v2ng/kde/kdebase-1.1/kfm/kfmwarn'
make[3]: Nothing to be done for `all'.
make[3]: Leaving directory `/home/v2ng/kde/kdebase-1.1/kfm/kfmwarn'
Making all in client
make[3]: Entering directory `/home/v2ng/kde/kdebase-1.1/kfm/client'
g++ -DHAVE_CONFIG_H -I. -I. -I../.. -I/usr/local/kde/include
-I/usr/local/qt/include  -I/usr/X11R6/include -I./..  -O2 -Wall -c
kfmclient.cpp
kfmclient.cpp: In function `int doIt(int, char **)':
kfmclient.cpp:204: no matching function for call to `KfmIpc::configure
()'
make[3]: *** [kfmclient.o] Error 1
make[3]: Leaving directory `/home/v2ng/kde/kdebase-1.1/kfm/client'
make[2]: *** [all-recursive] Error 1
make[2]: Leaving directory `/home/v2ng/kde/kdebase-1.1/kfm'
make[1]: *** [all-recursive] Error 1
make[1]: Leaving directory `/home/v2ng/kde/kdebase-1.1'
make: *** [all-recursive-am] Error 2

--
Victor Ng

2. more WinTrump problems.(true)

3. Problems compiling kdebase-3.0

4. Printing without a banner

5. compiling kdebase on solaris problem

6. Share USB printer over network Mac/Linux network?

7. Problem compiling kdebase package

8. Wanted: recursive lister for shell scripts

9. Problems compiling kdebase-1.93

10. problem compile kdebase-3

11. Compiling kdebase on Solaris - problem with UIC plugins?

12. Problem compiling kdebase...

13. error compiling kdebase 3.0 beta1