Still error compiling kde 1.1.1 on Sun Sparc (kdm error)

Still error compiling kde 1.1.1 on Sun Sparc (kdm error)

Post by Massimo Mori » Thu, 17 Jun 1999 04:00:00



Hi,
        this time  I get this error.
Does anyone get what is happening??
BTW, I think I can suvive without kdm ;))))

Thanks
                        Massimo

--
Massimo Morin        | Scheduling Systems Inc.
Software Engineer    |
-------------------  | Three University Office Park, suite 100
13, Charnwood Rd     | 95 Sawyer Road
Somerville 02144 MA  | Waltham,
-------------------  | 02453 Massachusetts
+1 (617) 623-4155    | +1 (781) 893-0390

----------------------------------------------------------------------
Never attribute to malice that which can be adequately explained by
stupidity.


Making all in config
make[1]: Entering directory
`/export/home/mmorin/kde/kdebase-1.1.1/kdm/config'
make[1]: Nothing to be done for `all'.
make[1]: Leaving directory
`/export/home/mmorin/kde/kdebase-1.1.1/kdm/config'
Making all in pics
make[1]: Entering directory
`/export/home/mmorin/kde/kdebase-1.1.1/kdm/pics'
make[1]: Nothing to be done for `all'.
make[1]: Leaving directory
`/export/home/mmorin/kde/kdebase-1.1.1/kdm/pics'
Making all in xdmconfig
make[1]: Entering directory
`/export/home/mmorin/kde/kdebase-1.1.1/kdm/xdmconfig'
make[1]: Nothing to be done for `all'.
make[1]: Leaving directory
`/export/home/mmorin/kde/kdebase-1.1.1/kdm/xdmconfig'
make[1]: Entering directory `/export/home/mmorin/kde/kdebase-1.1.1/kdm'
gcc -DHAVE_CONFIG_H -I. -I. -I.. -I/usr/local/kde/include
-I/export/home/mmorin/kde/qt-1.44/include
-I/usr/openwin/share/include/X11 -I/usr/local/kde/include    -O2 -Wall
-c error.c
error.c: In function `LogError':
error.c:108: number of arguments doesn't match prototype
kdm-config.h:93: prototype declaration
error.c: In function `LogOutOfMem':
error.c:185: number of arguments doesn't match prototype
kdm-config.h:94: prototype declaration
error.c: In function `Debug':
error.c:244: number of arguments doesn't match prototype
kdm-config.h:92: prototype declaration
make[1]: *** [error.o] Error 1
gcc -DHAVE_CONFIG_H -I. -I. -I.. -I/usr/local/kde/include
-I/export/home/mmorin/kde/qt-1.44/include
-I/usr/openwin/share/include/X11 -I/usr/local/kde/include    -O2 -Wall
-c genauth.c
genauth.c: In function `GenerateAuthData':
genauth.c:138: too few arguments to function `gettimeofday'
make[1]: *** [genauth.o] Error 1
make[1]: Target `all-am' not remade because of errors.
make[1]: Leaving directory `/export/home/mmorin/kde/kdebase-1.1.1/kdm'
make: *** [all-recursive] Error 1
make: Target `all' not remade because of errors.

SunOS zeus 5.5.1 Generic_103640-12 sun4u sparc SUNW,Ultra-2

 
 
 

Still error compiling kde 1.1.1 on Sun Sparc (kdm error)

Post by Gael de Chalenda » Fri, 18 Jun 1999 04:00:00



> Hi,
>         this time  I get this error.
> Does anyone get what is happening??
> BTW, I think I can suvive without kdm ;))))

> -c genauth.c
> genauth.c: In function `GenerateAuthData':
> genauth.c:138: too few arguments to function `gettimeofday'
> make[1]: *** [genauth.o] Error 1

Yes I had this problem too, and no time to solve it. Then I simply
commented the faulty line out (Oh very bad hack :-( ) and it works !

If you find better, please tell me.

Bye.

Gael
--

 
 
 

1. KDE 3.0.3 : Compile error in /kdm/backend

I can't compile kdebase 3.0.3 on my computer (SuSE 6.4 with a lot of
upgrade). No problems with the other packages (kdelibs, kdegames...) and no
problems with kdebase 3.0.2 !!
.../...
gcc -DHAVE_CONFIG_H -I. -I. -I../.. -I/usr/X11R6/include     -Dlinux
-D__i386__ -D_POSIX_C_SOURCE=199309L -D_POSIX_SOURCE -D_XOPEN_SOURCE -                      
D_BSD_SOURCE -D_SVID_SOURCE -DUNIXCONN -DTCPCONN -DOSMAJORVERSION=2
-DOSMINORVERSION=4 -DFRAGILE_DEV_MEM -DDEV_RANDOM -DHAS_MKSTEMP -DHAVE_                      
GETUSERSHELL -DUSE_SYSLOG -DUSE_PAM -DXDMCP -O2  -O9 -funroll-loops
-ffast-math -malign-double -mcpu=pentiumpro -march=pentiumpro -fomit-fr                      
ame-pointer -fno-exceptions -c `test -f auth.c || echo './'`auth.c
auth.c: In function `ConvertAuthAddr':
auth.c:678: `in_addr_t' undeclared (first use in this function)
auth.c:678: (Each undeclared identifier is reported only once
auth.c:678: for each function it appears in.)
auth.c:678: parse error before `)'
make[3]: *** [auth.o] Error 1
make[3]: Leaving directory
`/home/cm/LinuxPgm/kde-3.0.3/kdebase-3.0.3/kdm/backend'
make[2]: *** [all-recursive] Error 1
make[2]: Leaving directory `/home/cm/LinuxPgm/kde-3.0.3/kdebase-3.0.3/kdm'
make[1]: *** [all-recursive] Error 1
make[1]: Leaving directory `/home/cm/LinuxPgm/kde-3.0.3/kdebase-3.0.3'
make: *** [all] Error 2

Thanks for any help.

Claude MAHE
claude.mahe at wanadoo.fr
http://www.uppp.free.fr

2. Support On The "MySmart Pad" I/O Device

3. compiling KDE on sun/sparc

4. Problem installing CDE on Solaris 2.5.1

5. touch giving error on Sun 8 on Sparc

6. s3 and compaq w/ x

7. PPP: (sparc) sun solaris2.6 error: start_ppp: tcgetattr failed

8. How to? Adaptec AFW-4300 firewire and Red Hat 7.2

9. hard disk error's while installing v6.2 on Sun Sparc 2

10. KDE Errors: QSocketNotifier: Internal Error!

11. 2.4.8 compile error on sparc

12. ERROR: KDE shadow password error although no shadow passwords used

13. 2.5.42-ac1 serial compile error on sparc