Internal compile error compiling kdelib

Internal compile error compiling kdelib

Post by Robert Brought » Mon, 26 Apr 1999 04:00:00



The following happens when I attempt to compile
kdelibs-19990425-source-qt20.tar.gz 0n linux v2.2.5, gcc
version 2.7.2.3:
-----

kformula.cc: In method `double KFormula::evaluate(class QStrList, class QArray<double>, int * = 0, class box * = 0)':
kformula.cc:351: Internal compiler error.

make: *** [kformula.lo] Error 1
-----

Any ideas?

--
Spammer toll-free numbers: (800) 607-6006 ext. 2668, (877) 299-5465

Bob Broughton

WWW: http://canadawired.com/~rbrought
Vancouver, BC, Canada

 
 
 

1. kdelibs compile error

I'm having trouble compiling the kdelibs package.  I installed Qt ver 1.44
successfully.  Next I attempted to install 'kdelibs' but run into the
following error:

make[2] *** [AssertDialog.lo] Error 1
make[2] Leaving dir '/var/tmp/kdelibs-1.1/kab'
make[1] *** [all-recursive] Error 1

Any suggestions would be greatly appreciated.

2. Redhat 6.2 RAID level 1

3. errors compiling kdelibs

4. how to access a directory with a space in its name?

5. Error compiling kdelibs-2.0.*: "undefined reference to mainParse in kio/.libs/libksycoca.so"

6. TALK problem?!!??!

7. How to reclaim cleared disk space ?

8. compile error code 1 kdelibs 1.1 solaris 7

9. error compiling kdelibs 3.0 QDomDocument

10. kde2 compile error in kdelibs/kio

11. error trying to compile KDELIBs 2.2 from the sources in the KDE CVS server.

12. Error compiling KDE22beta1:kdelibs