problem compile kdebase-3

problem compile kdebase-3

Post by Thomas Pretzsc » Tue, 23 Apr 2002 20:27:54



Hi all;
I want to install KDE 3 from source, but I get stuck with compiling error.
I`m using Debian Woody. With kde-2.2 everything works fine.
I`ve tried also ./configure  --without-xdmcp and --without-pam
and it`s the same story. Can anyone help?
The Error is:

make[2]: Leaving directory `/opt/kde3/kdebase-3.0/kdesu'
Making all in kdm
make[2]: Entering directory `/opt/kde3/kdebase-3.0/kdm'
Making all in backend
make[3]: Entering directory `/opt/kde3/kdebase-3.0/kdm/backend'
/bin/sh ../../libtool --mode=link gcc -Dlinux -D__i386__
-D_POSIX_C_SOURCE=199309L -D_POSIX_SOURCE -D_XOPEN_SOURCE -D_BSD_SOURCE
-D_SVID_SOURCE -DUNIXCONN -DTCPCONN -DOSMAJORVERSION=2 -DOSMINORVERSION=4
-DHASXDMAUTH -DFRAGILE_DEV_MEM -DDEV_RANDOM -DHAS_MKSTEMP
-DHAVE_GETUSERSHELL -DUSE_SYSLOG -DUSESHADOW -O2    -L/usr/X11R6/lib
-L/usr/lib/qt/lib -L/opt/kde3/lib  -R /opt/kde3/lib -R /usr/lib/qt/lib -R
/usr/X11R6/lib  -o kdm  access.o auth.o choose.o client.o daemon.o dm.o
dpylist.o error.o genauth.o krb5auth.o mitauth.o netaddr.o policy.o
process.o protodpy.o reset.o resource.o rpcauth.o server.o session.o
socket.o streams.o util.o xdmauth.o xdmcp.o -lX11 -lresolv -lXau  -lcrypt  
  -lresolv -lresolv  -lutil
gcc -Dlinux -D__i386__ -D_POSIX_C_SOURCE=199309L -D_POSIX_SOURCE
-D_XOPEN_SOURCE -D_BSD_SOURCE -D_SVID_SOURCE -DUNIXCONN -DTCPCONN
-DOSMAJORVERSION=2 -DOSMINORVERSION=4 -DHASXDMAUTH -DFRAGILE_DEV_MEM
-DDEV_RANDOM -DHAS_MKSTEMP -DHAVE_GETUSERSHELL -DUSE_SYSLOG -DUSESHADOW -O2
-o kdm access.o auth.o choose.o client.o daemon.o dm.o dpylist.o error.o
genauth.o krb5auth.o mitauth.o netaddr.o policy.o process.o protodpy.o
reset.o resource.o rpcauth.o server.o session.o socket.o streams.o util.o
xdmauth.o xdmcp.o  -L/usr/X11R6/lib -L/usr/lib/qt/lib -L/opt/kde3/lib -lX11
-lXau -lcrypt -lresolv -lutil -Wl,--rpath -Wl,/opt/kde3/lib -Wl,--rpath
-Wl,/usr/lib/qt/lib -Wl,--rpath -Wl,/usr/X11R6/lib
genauth.o: In function `InitXdmcpWrapper':
genauth.o(.text+0x6d): undefined reference to `_XdmcpWrapperToOddParity'
genauth.o: In function `GenerateAuthData':
genauth.o(.text+0x100): undefined reference to `_XdmcpAuthSetup'
genauth.o(.text+0x12f): undefined reference to `_XdmcpAuthDoIt'
collect2: ld returned 1 exit status
make[3]: *** [kdm] Error 1
make[3]: Leaving directory `/opt/kde3/kdebase-3.0/kdm/backend'
make[2]: *** [all-recursive] Error 1
make[2]: Leaving directory `/opt/kde3/kdebase-3.0/kdm'
make[1]: *** [all-recursive] Error 1
make[1]: Leaving directory `/opt/kde3/kdebase-3.0'
make: *** [all] Error

Best regards
 Tom

 
 
 

1. Problems compiling kdebase-3.0

I'm running Debian 3.0 `Sid' with kernel 2.4.18 on a Athlon Thunderbird 1200.
I want to install KDE 3 from source, but I get stuck with compiling kdebase.

When I do a make all for kdebase-3.0, I receive the following errors:

In file included from favicons.cpp:29:
/usr/include/kde/kicontheme.h:160: syntax error before `;'
In file included from /usr/include/kde/kio/job.h:25,
                 from favicons.cpp:33:
/usr/include/kde/kio/jobclasses.h:248: syntax error before `;'

What could I be doing wrong?

2. NIS ypbind problems

3. Problem compiling kdebase package

4. amd & Sun-NIS-maps?

5. Problems compiling kdebase-1.93

6. linksys etherfast pci card does NOT work!

7. Problem compiling kdebase...

8. Unix>windows/dos convert

9. Compilation problems in kdebase-3.0

10. kdebase-3.0.2 compilation problems

11. 1.1.1 kdebase compile problem

12. compiling kdebase on solaris problem

13. Compiling kdebase on Solaris - problem with UIC plugins?