2.5.47 / unusual ext3 fs errors

2.5.47 / unusual ext3 fs errors

Post by CaT » Wed, 13 Nov 2002 01:20:08



Under 2.5.x I seem to be getting a lot of fs errors on fsck, mainly
dealing with bad inode counts in groups. Just now though, I had /var
remounted read-only due to the following:

t_transaction: Journal has aborted
EXT3-fs error (device ide0(3,9)) in start_transaction: Journal has aborted
EXT3-fs error (device ide0(3,9)) in start_transaction: Journal has aborted
EXT3-fs error (device ide0(3,9)) in start_transaction: Journal has aborted
...
EXT3-fs error (device ide0(3,9)) in start_transaction: Journal has aborted
EXT3-fs error (device ide0(3,9)) in start_transaction: Journal has aborted
EXT3-fs error (device ide0(3,9)) in start_transaction: Journal has aborted

And again, on reboot into single user mode and a full fsck bad inode
count errors were present. There were no errors detected whilst testing
the disk with -c.

Under 2.4.x my filesystems never showed errors.

I'd provide more info but this is all that I have. If you need more then
you'll need to tell me what to do to get it. :)

Thanks.

--
        All people are equal,
        But some are more equal then others.
            - George W. Bush Jr, President of the United States
              September 21, 2002 (Abridged version of security speech)
-
To unsubscribe from this list: send the line "unsubscribe linux-kernel" in

More majordomo info at  http://vger.kernel.org/majordomo-info.html
Please read the FAQ at  http://www.tux.org/lkml/

 
 
 

2.5.47 / unusual ext3 fs errors

Post by Andrew Morto » Wed, 13 Nov 2002 01:30:21



> Under 2.5.x I seem to be getting a lot of fs errors on fsck, mainly
> dealing with bad inode counts in groups. Just now though, I had /var
> remounted read-only due to the following:

> t_transaction: Journal has aborted
> EXT3-fs error (device ide0(3,9)) in start_transaction: Journal has aborted
> EXT3-fs error (device ide0(3,9)) in start_transaction: Journal has aborted
> EXT3-fs error (device ide0(3,9)) in start_transaction: Journal has aborted
> ...
> EXT3-fs error (device ide0(3,9)) in start_transaction: Journal has aborted
> EXT3-fs error (device ide0(3,9)) in start_transaction: Journal has aborted
> EXT3-fs error (device ide0(3,9)) in start_transaction: Journal has aborted

> And again, on reboot into single user mode and a full fsck bad inode
> count errors were present. There were no errors detected whilst testing
> the disk with -c.

There was a problem in 2.5.46 which mucked up these counters.  On disk.

2.5.47 fixed that bug, and now you have fixed the on-disk mess which 2.5.46
created, all should be well.
-
To unsubscribe from this list: send the line "unsubscribe linux-kernel" in

More majordomo info at  http://vger.kernel.org/majordomo-info.html
Please read the FAQ at  http://www.tux.org/lkml/

 
 
 

2.5.47 / unusual ext3 fs errors

Post by CaT » Wed, 13 Nov 2002 01:40:10




> > And again, on reboot into single user mode and a full fsck bad inode
> > count errors were present. There were no errors detected whilst testing
> > the disk with -c.

> There was a problem in 2.5.46 which mucked up these counters.  On disk.

> 2.5.47 fixed that bug, and now you have fixed the on-disk mess which 2.5.46
> created, all should be well.

Sweet. Thanks. :)

--
        All people are equal,
        But some are more equal then others.
            - George W. Bush Jr, President of the United States
              September 21, 2002 (Abridged version of security speech)
-
To unsubscribe from this list: send the line "unsubscribe linux-kernel" in

More majordomo info at  http://vger.kernel.org/majordomo-info.html
Please read the FAQ at  http://www.tux.org/lkml/

 
 
 

1. 2.5.47 : fs/nfsd/nfs4proc.c compile error

Hello all,
   While 'make bzImage', I received the following error.

Regards,
Frank

fs/nfsd/nfs4proc.c: In function `nfsd4_write':
fs/nfsd/nfs4proc.c:484: warning: passing arg 4 of `nfsd_write' from incompatible pointer type
fs/nfsd/nfs4proc.c:484: warning: passing arg 6 of `nfsd_write' makes integer from pointer without a cast
fs/nfsd/nfs4proc.c:484: too few arguments to function `nfsd_write'
fs/nfsd/nfs4proc.c: In function `nfsd4_proc_compound':
fs/nfsd/nfs4proc.c:568: structure has no member named `rq_resbuf'
fs/nfsd/nfs4proc.c:569: structure has no member named `rq_resbuf'
fs/nfsd/nfs4proc.c:569: structure has no member named `rq_resbuf'
make[2]: *** [fs/nfsd/nfs4proc.o] Error 1
make[1]: *** [fs/nfsd] Error 2
make: *** [fs] Error 2

-
To unsubscribe from this list: send the line "unsubscribe linux-kernel" in

More majordomo info at  http://vger.kernel.org/majordomo-info.html
Please read the FAQ at  http://www.tux.org/lkml/

2. Laptop/Suse/FirewireCDROM/ no loop back device... Please help

3. 2.5.47 - Assertion failed in fs/jbd/journal.c:415

4. curses

5. FS corruption with 2.5.47

6. Automated Kermit Scripts, Sun-Vax

7. error building - kernel 2.5.47 +patch2.5.47-bk2

8. can't login

9. second error, bttv 2.5.47

10. 2.5.47-bk1: error compiling skbuff.c

11. 2.5.47 NFSv4 compile error

12. Linux 2.5.47 compile error

13. 2.5.47 RadeonFB compile error