2.5.48/BK current compile failure

2.5.48/BK current compile failure

Post by Dax Kelso » Wed, 20 Nov 2002 07:10:08



[snip]
make -f scripts/Makefile.build obj=net/wanrouter
make -f scripts/Makefile.build obj=lib
make -f scripts/Makefile.build obj=lib/zlib_deflate
make -f scripts/Makefile.build obj=lib/zlib_inflate
make -f scripts/Makefile.build obj=arch/i386/lib
  Generating build number
  Generating include/linux/compile.h (updated)
  gcc -Wp,-MD,init/.version.o.d -D__KERNEL__ -Iinclude -Wall -Wstrict-prototypes -Wno-trigraphs -O2 -fomit-frame-pointer -fno-strict-aliasing -fno-common -pipe
-mpreferred-stack-boundary=2 -march=pentium4 -Iarch/i386/mach-generic -nostdinc
-iwithprefix include    -DKBUILD_BASENAME=version -DKBUILD_MODNAME=version   -c
-o init/version.o init/version.c
   ld -m elf_i386  -r -o init/built-in.o init/main.o init/version.o init/do_mounts.o init/initramfs.o
        ld -m elf_i386 -e stext -T arch/i386/vmlinux.lds.s arch/i386/kernel/head.o arch/i386/kernel/init_task.o  init/built-in.o --start-group  usr/built-in.o
arch/i386/kernel/built-in.o  arch/i386/mm/built-in.o  arch/i386/mach-generic/built-in.o  kernel/built-in.o  mm/built-in.o  fs/built-in.o  ipc/built-in.o  security/built-in.o  crypto/built-in.o  lib/lib.a  arch/i386/lib/lib.a  drivers/built-in.o  sound/built-in.o  arch/i386/pci/built-in.o  net/built-in.o --end-group  -o .tmp_vmlinux1
arch/i386/kernel/built-in.o: In function `do_suspend_lowlevel':
arch/i386/kernel/built-in.o(.data+0x1304): undefined reference to `save_processor_state'
arch/i386/kernel/built-in.o(.data+0x130a): undefined reference to `saved_context_esp'
arch/i386/kernel/built-in.o(.data+0x130f): undefined reference to `saved_context_eax'
arch/i386/kernel/built-in.o(.data+0x1315): undefined reference to `saved_context_ebx'
arch/i386/kernel/built-in.o(.data+0x131b): undefined reference to `saved_context_ecx'
arch/i386/kernel/built-in.o(.data+0x1321): undefined reference to `saved_context_edx'
arch/i386/kernel/built-in.o(.data+0x1327): undefined reference to `saved_context_ebp'
arch/i386/kernel/built-in.o(.data+0x132d): undefined reference to `saved_context_esi'
arch/i386/kernel/built-in.o(.data+0x1333): undefined reference to `saved_context_edi'
arch/i386/kernel/built-in.o(.data+0x133a): undefined reference to `saved_context_eflags'
arch/i386/kernel/built-in.o(.data+0x137a): undefined reference to `saved_context_esp'
arch/i386/kernel/built-in.o(.data+0x1380): undefined reference to `saved_context_ebp'
arch/i386/kernel/built-in.o(.data+0x1385): undefined reference to `saved_context_eax'
arch/i386/kernel/built-in.o(.data+0x138b): undefined reference to `saved_context_ebx'
arch/i386/kernel/built-in.o(.data+0x1391): undefined reference to `saved_context_ecx'
arch/i386/kernel/built-in.o(.data+0x1397): undefined reference to `saved_context_edx'
arch/i386/kernel/built-in.o(.data+0x139d): undefined reference to `saved_context_esi'
arch/i386/kernel/built-in.o(.data+0x13a3): undefined reference to `saved_context_edi'
arch/i386/kernel/built-in.o(.data+0x13a8): undefined reference to `restore_processor_state'
arch/i386/kernel/built-in.o(.data+0x13ae): undefined reference to `saved_context_eflags'
drivers/built-in.o: In function `kd_nosound':
drivers/built-in.o(.text+0x420ea): undefined reference to `input_event'
drivers/built-in.o(.text+0x4210c): undefined reference to `input_event'
drivers/built-in.o: In function `kd_mksound':
drivers/built-in.o(.text+0x421ab): undefined reference to `input_event'
drivers/built-in.o: In function `kbd_bh':
drivers/built-in.o(.text+0x42f07): undefined reference to `input_event'
drivers/built-in.o(.text+0x42f2a): undefined reference to `input_event'
drivers/built-in.o(.text+0x42f49): more undefined references to `input_event' follow
drivers/built-in.o: In function `kbd_connect':
drivers/built-in.o(.text+0x434a3): undefined reference to `input_open_device'
drivers/built-in.o: In function `kbd_disconnect':
drivers/built-in.o(.text+0x434cf): undefined reference to `input_close_device'
drivers/built-in.o: In function `alloc_targets':
drivers/built-in.o(.text+0x8d0a7): undefined reference to `vcalloc'
drivers/built-in.o: In function `setup_indexes':
drivers/built-in.o(.text+0x8dabb): undefined reference to `vcalloc'
drivers/built-in.o: In function `kbd_init':
drivers/built-in.o(.init.text+0x2527): undefined reference to `input_register_handler'
make: *** [.tmp_vmlinux1] Error 1

-
To unsubscribe from this list: send the line "unsubscribe linux-kernel" in

More majordomo info at  http://vger.kernel.org/majordomo-info.html
Please read the FAQ at  http://www.tux.org/lkml/

 
 
 

1. 2.5.48: compile failure in fs/devfs/base.c

2.5.48, Athlon, mostly modules, gcc-3.2 yields this:

  gcc -Wp,-MD,fs/devfs/.base.o.d -D__KERNEL__ -Iinclude -Wall -Wstrict-prototypes -Wno-trigraphs -O2 -fomit-frame-pointer -fno-strict-aliasing -fno-common -pipe -mpreferred-stack-boundary=2 -march=athlon -Iarch/i386/mach-generic -nostdinc -iwithprefix include    -DKBUILD_BASENAME=base -DKBUILD_MODNAME=devfs -DEXPORT_SYMTAB  -c -o fs/devfs/base.o fs/devfs/base.c
fs/devfs/base.c: In function `devfs_symlink':
fs/devfs/base.c:3032: incompatible types in assignment
fs/devfs/base.c:3033: incompatible types in assignment
fs/devfs/base.c:3034: incompatible types in assignment
fs/devfs/base.c: In function `devfs_mkdir':
fs/devfs/base.c:3063: incompatible types in assignment
fs/devfs/base.c:3064: incompatible types in assignment
fs/devfs/base.c:3065: incompatible types in assignment
fs/devfs/base.c: In function `devfs_mknod':
fs/devfs/base.c:3132: incompatible types in assignment
fs/devfs/base.c:3133: incompatible types in assignment
fs/devfs/base.c:3134: incompatible types in assignment
make[2]: *** [fs/devfs/base.o] Error 1
make[1]: *** [fs/devfs] Error 2
make: *** [fs] Error 2
-
To unsubscribe from this list: send the line "unsubscribe linux-kernel" in

More majordomo info at  http://vger.kernel.org/majordomo-info.html
Please read the FAQ at  http://www.tux.org/lkml/

2. why is NFSd so close to the kernel

3. Can't allocate memory when loading a module 2.5.48-bk

4. Virtual domains on Apache with only one ip?

5. 2.5.48-bk, md raid0 fix

6. Packerd Bell Laptop

7. 2.5.48+bk: piix: undefined references

8. Periodic table for SPARC 20

9. 2.5.48 Compilation Failure

10. 2.5.48 Compilation Failure skbuff.c

11. Compile error for 2.5.48

12. Compile error with kernel 2.5.48-bk2

13. sound/isa/sb/sb16.c doesn't compile in 2.5.48