tridentfb.c error kernel 2.5.50

tridentfb.c error kernel 2.5.50

Post by Dominique Arpi » Sat, 30 Nov 2002 16:40:08



Hi everybody,

           i have some problem to compile the tridentfd driver on the
           Kernel 2.5.50.I'm not sure this is the right mailinglist to submit my problem, but if u
can help me.This problem doesnt appear on the 2.4.19 kernel. Did I miss something?

gcc -Wp,-MD,drivers/video/.tridentfb.o.d -D__KERNEL__ -Iinclude -Wall
-Wstrict-prototypes -Wno-trigraphs -O2 -fno-strict-aliasing -fno-common -fomit-frame-pointer -pipe -mpreferred-stack-boundary=2 -march=i686
 -Iarch/i386/mach-generic -nostdinc -iwithprefix include -DMODULE  
 -DKBUILD_BASENAME=tridentfb -DKBUILD_MODNAME=tridentfb   -c -o
drivers/video/tridentfb.o drivers/video/tridentfb.cdrivers/video/tridentfb.c:64: field `gen' has incomplete type
drivers/video/tridentfb.c: In function `trident_set_disp':
drivers/video/tridentfb.c:1054: dereferencing pointer to incomplete type
drivers/video/tridentfb.c: At top level:
drivers/video/tridentfb.c:1086: variable `trident_hwswitch' has
initializer but incomplete typedrivers/video/tridentfb.c:1087: warning: excess elements in struct
initializerdrivers/video/tridentfb.c:1087: warning: (near initialization for
`trident_hwswitch')drivers/video/tridentfb.c:1088: warning: excess elements in struct
initializerdrivers/video/tridentfb.c:1088: warning: (near initialization for
`trident_hwswitch')drivers/video/tridentfb.c:1089: warning: excess elements in struct
initializerdrivers/video/tridentfb.c:1089: warning: (near initialization for
`trident_hwswitch')drivers/video/tridentfb.c:1090: warning: excess elements in struct
initializerdrivers/video/tridentfb.c:1090: warning: (near initialization for
`trident_hwswitch')drivers/video/tridentfb.c:1091: warning: excess elements in struct
initializerdrivers/video/tridentfb.c:1091: warning: (near initialization for
`trident_hwswitch')drivers/video/tridentfb.c:1092: warning: excess elements in struct
initializerdrivers/video/tridentfb.c:1092: warning: (near initialization for
`trident_hwswitch')drivers/video/tridentfb.c:1093: warning: excess elements in struct
initializerdrivers/video/tridentfb.c:1093: warning: (near initialization for
`trident_hwswitch')drivers/video/tridentfb.c:1094: warning: excess elements in struct
initializerdrivers/video/tridentfb.c:1094: warning: (near initialization for
`trident_hwswitch')drivers/video/tridentfb.c:1095: warning: excess elements in struct
initializerdrivers/video/tridentfb.c:1095: warning: (near initialization for
`trident_hwswitch')drivers/video/tridentfb.c:1097: warning: excess elements in struct
initializerdrivers/video/tridentfb.c:1097: warning: (near initialization for
`trident_hwswitch')drivers/video/tridentfb.c: In function `tridentfb_init':
drivers/video/tridentfb.c:1204: `fbgen_switch' undeclared (first use in
this function)drivers/video/tridentfb.c:1204: (Each undeclared identifier is reported
only oncedrivers/video/tridentfb.c:1204: for each function it appears in.)
drivers/video/tridentfb.c:1205: `fbgen_update_var' undeclared (first use
in this function)drivers/video/tridentfb.c:1228: warning: implicit declaration of function
`fbgen_get_var'drivers/video/tridentfb.c:1230: warning: implicit declaration of function
`fbgen_set_disp'drivers/video/tridentfb.c: At top level:
drivers/video/tridentfb.c:1289: unknown field `fb_get_fix' specified in
initializerdrivers/video/tridentfb.c:1289: `fbgen_get_fix' undeclared here (not in a
function)drivers/video/tridentfb.c:1289: initializer element is not constant
drivers/video/tridentfb.c:1289: (near initialization for
`tridentfb_ops.owner')drivers/video/tridentfb.c:1290: unknown field `fb_get_var' specified in
initializerdrivers/video/tridentfb.c:1290: `fbgen_get_var' undeclared here (not in a
function)drivers/video/tridentfb.c:1290: initializer element is not constant
drivers/video/tridentfb.c:1290: (near initialization for
`tridentfb_ops.fb_open')drivers/video/tridentfb.c:1291: `fbgen_set_var' undeclared here (not in a
function)[....]
drivers/video/tridentfb.c:1296: initializer element is not constant
drivers/video/tridentfb.c:1296: (near initialization for `tridentfb_ops')
make[2]: *** [drivers/video/tridentfb.o] Error 1
make[1]: *** [drivers/video] Error 2
make: *** [drivers] Error 2

My hardware:
laptop presario 1200
Trident*blade 8 mb

and sorry for my english :)

--
Dominique Arpin_______________________[   espace
gestionnaire rseau                     courbe    ]

                                          http://www.veryComputer.com/
                                          tlphone    514.933.9861
                                          tlcopieur  514.933.9546

-
To unsubscribe from this list: send the line "unsubscribe linux-kernel" in

More majordomo info at  http://www.veryComputer.com/
Please read the FAQ at  http://www.veryComputer.com/

 
 
 

tridentfb.c error kernel 2.5.50

Post by James Simmon » Thu, 05 Dec 2002 23:50:23


Quote:>            i have some problem to compile the tridentfd driver on the
>            Kernel 2.5.50.I'm not sure this is the right mailinglist to submit my problem, but if u
> can help me.This problem doesnt appear on the 2.4.19 kernel. Did I miss something?

The framebuffer api has changed. A port of the driver will be done in the
next few releases.

-
To unsubscribe from this list: send the line "unsubscribe linux-kernel" in

More majordomo info at  http://vger.kernel.org/majordomo-info.html
Please read the FAQ at  http://www.tux.org/lkml/

 
 
 

1. Error in "make modules" with Kernel 2.5.50

Hi

After successfully compressed the bzImage ... in upgradeing the REDHAT 7.3
Kernel to 2.5.50!!
when running "make modules" .. those are the error the computer return these
following errors ...

==Error==Error==Error==Error==Error==Error==Error==Error==Error==Error==Erro
r==Error==Error==Error==Error

make -f scripts/Makefile.build obj=fs/intermezzo

gcc -Wp,-MD,fs/intermezzo/.cache.o.d -D__KERNEL__ -Iinclude -Wall -Wstrict-p
rototypes -Wno-trigraphs -O2 -fno-strict-aliasing -fno-common -fomit-frame-p
ointer -pipe -mpreferred-stack-boundary=2 -march=i686 -Iarch/i386/mach-gener
ic -nostdinc -iwithprefix
include -DMODULE   -DKBUILD_BASENAME=cache -DKBUILD_MODNAME=intermezzo   -c
-o fs/intermezzo/cache.o fs/intermezzo/cache.c
In file included from fs/intermezzo/cache.c:42:
include/linux/intermezzo_fs.h:30:34: linux/intermezzo_lib.h: No such file or
directory
include/linux/intermezzo_fs.h:31:34: linux/intermezzo_idl.h: No such file or
directory
In file included from fs/intermezzo/cache.c:42:
include/linux/intermezzo_fs.h:49: field `remote_version' has incomplete type
include/linux/intermezzo_fs.h:52: warning: `struct izo_ioctl_data' declared
inside parameter list
include/linux/intermezzo_fs.h:52: warning: its scope is only this definition
or declaration, which is probably not what you want.
In file included from fs/intermezzo/cache.c:42:
.
.
.
.
.
.
include/linux/intermezzo_fs.h:905: dereferencing pointer to incomplete type
include/linux/intermezzo_fs.h:906: dereferencing pointer to incomplete type
include/linux/intermezzo_fs.h:906: dereferencing pointer to incomplete type
include/linux/intermezzo_fs.h:910: dereferencing pointer to incomplete type
include/linux/intermezzo_fs.h:911: dereferencing pointer to incomplete type
include/linux/intermezzo_fs.h:911: dereferencing pointer to incomplete type
include/linux/intermezzo_fs.h:911: dereferencing pointer to incomplete type
include/linux/intermezzo_fs.h: At top level:
include/linux/intermezzo_fs.h:920: warning: `struct kml_rec' declared inside
parameter list
include/linux/intermezzo_fs.h:921: warning: `struct kml_rec' declared inside
parameter list
make[2]: *** [fs/intermezzo/cache.o] Error 1
make[1]: *** [fs/intermezzo] Error 2
make: *** [fs] Error 2

==Error==Error==Error==Error==Error==Error==Error==Error==Error==Error==Erro
r==Error==Error==Error==Error

Can someone give me some idea to solve these errors, PLEASE
Thank YOU

2. Bloated gtk+ programs?

3. 2.5.50 mpu401.h compilation error patches

4. Does *anybody* have FrontPage 98 extensions & SSL working together?

5. driver update to kernel 2.5.50?

6. a whole bunch of questions!

7. error compiling 2.5.50

8. NFS - how???

9. unixbench result for kernel 2.5.49 and 2.5.50

10. Dell i8k was: Re: [2.5.50, ACPI] link error

11. : compile error with "Frame-buffer Support" in 2.5.50

12. 2.5.50 link error: kd_nosound

13. 2.5.50 : arch/i386/mm/hugetblpage.c error