Linux 2.5.47 compile error

Linux 2.5.47 compile error

Post by Michael Kumme » Tue, 12 Nov 2002 12:10:13



make -f scripts/Makefile.build obj=drivers/video/riva
  gcc -Wp,-MD,drivers/video/riva/.fbdev.o.d -D__KERNEL__ -Iinclude -Wall
-Wstrict-prototypes -Wno-trigraphs -O2 -fomit-frame-pointer
-fno-strict-aliasing -fno-common -pipe -mpreferred-stack-boundary=2
-march=i686 -malign-functions=4 -Iarch/i386/mach-generic -nostdinc
-iwithprefix include    -DKBUILD_BASENAME=fbdev   -c -o
drivers/video/riva/fbdev.o drivers/video/riva/fbdev.c
drivers/video/riva/fbdev.c: In function `riva_set_dispsw':
drivers/video/riva/fbdev.c:665: structure has no member named `type'
drivers/video/riva/fbdev.c:666: structure has no member named `type_aux'
drivers/video/riva/fbdev.c:667: structure has no member named `ypanstep'
drivers/video/riva/fbdev.c:668: structure has no member named `ywrapstep'
drivers/video/riva/fbdev.c:677: structure has no member named
`line_length'
drivers/video/riva/fbdev.c:678: structure has no member named `visual'
drivers/video/riva/fbdev.c:686: structure has no member named
`line_length'
drivers/video/riva/fbdev.c:687: structure has no member named `visual'
drivers/video/riva/fbdev.c:695: structure has no member named
`line_length'
drivers/video/riva/fbdev.c:696: structure has no member named `visual'
drivers/video/riva/fbdev.c: In function `rivafb_get_fix':
drivers/video/riva/fbdev.c:1294: structure has no member named `type'
drivers/video/riva/fbdev.c:1295: structure has no member named `type_aux'
drivers/video/riva/fbdev.c:1296: structure has no member named `visual'
drivers/video/riva/fbdev.c:1302: structure has no member named
`line_length'
drivers/video/riva/fbdev.c: In function `rivafb_pan_display':
drivers/video/riva/fbdev.c:1611: structure has no member named
`line_length'
drivers/video/riva/fbdev.c:1586: warning: `base' might be used
uninitialized in this function
drivers/video/riva/fbdev.c: At top level:
drivers/video/riva/fbdev.c:1748: unknown field `fb_get_fix' specified in
initializer
drivers/video/riva/fbdev.c:1748: warning: initialization from incompatible
pointer type
drivers/video/riva/fbdev.c:1749: unknown field `fb_get_var' specified in
initializer
drivers/video/riva/fbdev.c:1749: warning: initialization from incompatible
pointer type
make[3]: *** [drivers/video/riva/fbdev.o] Error 1
make[2]: *** [drivers/video/riva] Error 2
make[1]: *** [drivers/video] Error 2
make: *** [drivers] Error 2

--
best regards

Michael Kummer

--
Michael Kummer - [A]ustrian [E]lite [S]printer
Lieferinger-Hauptstrasse 47 - A 5020 Salzburg
Mobile: +43 664 3333995

Web: http://www.sprinter.cc

-
To unsubscribe from this list: send the line "unsubscribe linux-kernel" in

More majordomo info at  http://vger.kernel.org/majordomo-info.html
Please read the FAQ at  http://www.tux.org/lkml/

 
 
 

Linux 2.5.47 compile error

Post by James Simmon » Wed, 13 Nov 2002 19:50:16


IT will be fixed in the next change set.


> make -f scripts/Makefile.build obj=drivers/video/riva
>   gcc -Wp,-MD,drivers/video/riva/.fbdev.o.d -D__KERNEL__ -Iinclude -Wall
> -Wstrict-prototypes -Wno-trigraphs -O2 -fomit-frame-pointer
> -fno-strict-aliasing -fno-common -pipe -mpreferred-stack-boundary=2
> -march=i686 -malign-functions=4 -Iarch/i386/mach-generic -nostdinc
> -iwithprefix include    -DKBUILD_BASENAME=fbdev   -c -o
> drivers/video/riva/fbdev.o drivers/video/riva/fbdev.c
> drivers/video/riva/fbdev.c: In function `riva_set_dispsw':
> drivers/video/riva/fbdev.c:665: structure has no member named `type'
> drivers/video/riva/fbdev.c:666: structure has no member named `type_aux'
> drivers/video/riva/fbdev.c:667: structure has no member named `ypanstep'
> drivers/video/riva/fbdev.c:668: structure has no member named `ywrapstep'
> drivers/video/riva/fbdev.c:677: structure has no member named
> `line_length'
> drivers/video/riva/fbdev.c:678: structure has no member named `visual'
> drivers/video/riva/fbdev.c:686: structure has no member named
> `line_length'
> drivers/video/riva/fbdev.c:687: structure has no member named `visual'
> drivers/video/riva/fbdev.c:695: structure has no member named
> `line_length'
> drivers/video/riva/fbdev.c:696: structure has no member named `visual'
> drivers/video/riva/fbdev.c: In function `rivafb_get_fix':
> drivers/video/riva/fbdev.c:1294: structure has no member named `type'
> drivers/video/riva/fbdev.c:1295: structure has no member named `type_aux'
> drivers/video/riva/fbdev.c:1296: structure has no member named `visual'
> drivers/video/riva/fbdev.c:1302: structure has no member named
> `line_length'
> drivers/video/riva/fbdev.c: In function `rivafb_pan_display':
> drivers/video/riva/fbdev.c:1611: structure has no member named
> `line_length'
> drivers/video/riva/fbdev.c:1586: warning: `base' might be used
> uninitialized in this function
> drivers/video/riva/fbdev.c: At top level:
> drivers/video/riva/fbdev.c:1748: unknown field `fb_get_fix' specified in
> initializer
> drivers/video/riva/fbdev.c:1748: warning: initialization from incompatible
> pointer type
> drivers/video/riva/fbdev.c:1749: unknown field `fb_get_var' specified in
> initializer
> drivers/video/riva/fbdev.c:1749: warning: initialization from incompatible
> pointer type
> make[3]: *** [drivers/video/riva/fbdev.o] Error 1
> make[2]: *** [drivers/video/riva] Error 2
> make[1]: *** [drivers/video] Error 2
> make: *** [drivers] Error 2

-
To unsubscribe from this list: send the line "unsubscribe linux-kernel" in

More majordomo info at  http://vger.kernel.org/majordomo-info.html
Please read the FAQ at  http://www.tux.org/lkml/

 
 
 

Linux 2.5.47 compile error

Post by James Simmon » Tue, 19 Nov 2002 22:00:19


I just finished the aty128 driver last night to tha lastest api. I haven't
commited just yet. I started to test the 3Dfx driver and will work on the
riva driver tonight.

-
To unsubscribe from this list: send the line "unsubscribe linux-kernel" in

More majordomo info at  http://vger.kernel.org/majordomo-info.html
Please read the FAQ at  http://www.tux.org/lkml/

 
 
 

1. 2.5.47-bk1: error compiling skbuff.c

I didn't see this in the archives yet... Linux 2.5.47-bk1, Debian Testing

  gcc -Wp,-MD,net/core/.skbuff.o.d -D__KERNEL__ -Iinclude -Wall
-Wstrict-prototypes -Wno-trigraphs -O2 -fomit-frame-pointer
-fno-strict-aliasing -fno-common -pipe -mpreferred-stack-boundary=2
-march=i686 -Iarch/i386/mach-generic -nostdinc -iwithprefix include
-DKBUILD_BASENAME=skbuff -DKBUILD_MODNAME=skbuff   -c -o net/core/skbuff.o
net/core/skbuff.c
In file included from include/net/xfrm.h:6,
                 from net/core/skbuff.c:61:
include/linux/crypto.h: In function `crypto_tfm_alg_modname':
include/linux/crypto.h:202: dereferencing pointer to incomplete type
include/linux/crypto.h:205: warning: control reaches end of non-void function
make[2]: *** [net/core/skbuff.o] Error 1
make[1]: *** [net/core] Error 2
make: *** [net] Error 2

CONFIG_SECURITY_CAPABILITIES=y
# CONFIG_CRYPTO is not set

Linux razor 2.5.46 #1 Fri Nov 8 17:34:37 EST 2002 i686 Pentium II
(Klamath) GenuineIntel GNU/Linux

Gnu C                  2.95.4
Gnu make               3.79.1
util-linux             2.11n
mount                  2.11n
modutils               2.4.19
e2fsprogs              1.30-WIP
Linux C Library        2.2.5
Dynamic linker (ldd)   2.2.5
Procps                 2.0.7
Net-tools              1.60
Console-tools          0.2.3
Sh-utils               4.5.2

--

Linux: the "grim reaper of innocent orphaned children."
          from /usr/src/linux-2.4.18/init/main.c:461

-
To unsubscribe from this list: send the line "unsubscribe linux-kernel" in

More majordomo info at  http://vger.kernel.org/majordomo-info.html
Please read the FAQ at  http://www.tux.org/lkml/

2. help with qpopper (popper)

3. 2.5.47 NFSv4 compile error

4. Desperately in need of help!

5. 2.5.47 RadeonFB compile error

6. Kernel PPP works slowly

7. 2.5.47 "DAC960" Compile Error

8. Linux, PPP, Sendmail & POP3....

9. 2.5.47 ipv4 netfilter compile time error

10. cs46xx compile error 2.5.47

11. 2.5.47-bk compile errors: smbfs, cifs, nfs4, gameport, bttv

12. 2.5.47 : fs/nfsd/nfs4proc.c compile error

13. : Compile error on 2.5.47 with TCPMSS support enabled