bk current - new module build failures

bk current - new module build failures

Post by Kevin Brosiu » Sun, 17 Nov 2002 19:40:08



The attached module build failures are new since 2.5.46...

--
Kevin

[ bk_current_be < 1K ]
drivers/net/depca.c:2048: redefinition of `__module_name'
drivers/net/depca.c:469: `__module_name' previously defined here
{standard input}: Assembler messages:
{standard input}:3772: Error: symbol `__module_name' is already defined
make[2]: *** [drivers/net/depca.o] Error 1

net/wanrouter/wanmain.c:224: redefinition of `__module_name'
net/wanrouter/wanmain.c:130: `__module_name' previously defined here
{standard input}: Assembler messages:
{standard input}:43: Error: symbol `__module_name' is already defined
make[2]: *** [net/wanrouter/wanmain.o] Error 1

 
 
 

1. bk current build failures (xfrm.h / tpqic02.c)

I see the two attached build failures with bk current.

--
Kevin

[ bk_current_bf < 1K ]
net/core/skbuff.c: At top level:
include/net/xfrm.h:104: storage size of `lft' isn't known
include/net/xfrm.h:112: storage size of `replay' isn't known
include/net/xfrm.h:115: storage size of `stats' isn't known
include/net/xfrm.h:117: storage size of `curlft' isn't known
make[2]: *** [net/core/skbuff.o] Error 1

drivers/char/tpqic02.c: In function `__initfn':
drivers/char/tpqic02.c:2798: parse error before "void"
make[2]: *** [drivers/char/tpqic02.o] Error 1

2. Coax and 10Base-T mixed?

3. 2.5.48/BK current compile failure

4. An easy question to answer....if you know the answer. :))

5. BK current compile failure

6. '(no

7. 2.5.39-bk current compile failure

8. 2 simple unix questions???

9. current BK boot failure, d_alloc()

10. 2.5.61+ (BK current) compile failures

11. Link failure with current bk w/o CONFIG_X86_POWERNOW_K6

12. current bk ipmi build fix

13. hpt366.c cannot be built in current 2.4 bk snapshot