2.5.47 NFSv4 compile error

2.5.47 NFSv4 compile error

Post by John Ki » Tue, 12 Nov 2002 13:10:07



fs/nfsd/nfs4proc.c: In function `nfsd4_write':
fs/nfsd/nfs4proc.c:484: warning: passing arg 4 of `nfsd_write' from
incompatible pointer type
fs/nfsd/nfs4proc.c:484: warning: passing arg 6 of `nfsd_write' makes
integer from pointer without a cast
fs/nfsd/nfs4proc.c:484: too few arguments to function `nfsd_write'
fs/nfsd/nfs4proc.c: In function `nfsd4_proc_compound':
fs/nfsd/nfs4proc.c:568: structure has no member named `rq_resbuf'
fs/nfsd/nfs4proc.c:569: structure has no member named `rq_resbuf'
fs/nfsd/nfs4proc.c:569: structure has no member named `rq_resbuf'
make[2]: *** [fs/nfsd/nfs4proc.o] Error 1
make[1]: *** [fs/nfsd] Error 2
make: *** [fs] Error 2

.config

CONFIG_NFS_FS=y
CONFIG_NFS_V3=y
CONFIG_NFS_V4=y
CONFIG_NFSD=y
CONFIG_NFSD_V3=y
CONFIG_NFSD_V4=y
# CONFIG_NFSD_TCP is not set

My gcc is 3.1.1.   I get same error using gcc 3.2.  When I take out
CONFIG_NFS_V4 and CONFIG_NFSD_V4 it compiles just fine.

John Kim

-
To unsubscribe from this list: send the line "unsubscribe linux-kernel" in

More majordomo info at  http://vger.kernel.org/majordomo-info.html
Please read the FAQ at  http://www.tux.org/lkml/

 
 
 

1. 2.5.47-bk1: error compiling skbuff.c

I didn't see this in the archives yet... Linux 2.5.47-bk1, Debian Testing

  gcc -Wp,-MD,net/core/.skbuff.o.d -D__KERNEL__ -Iinclude -Wall
-Wstrict-prototypes -Wno-trigraphs -O2 -fomit-frame-pointer
-fno-strict-aliasing -fno-common -pipe -mpreferred-stack-boundary=2
-march=i686 -Iarch/i386/mach-generic -nostdinc -iwithprefix include
-DKBUILD_BASENAME=skbuff -DKBUILD_MODNAME=skbuff   -c -o net/core/skbuff.o
net/core/skbuff.c
In file included from include/net/xfrm.h:6,
                 from net/core/skbuff.c:61:
include/linux/crypto.h: In function `crypto_tfm_alg_modname':
include/linux/crypto.h:202: dereferencing pointer to incomplete type
include/linux/crypto.h:205: warning: control reaches end of non-void function
make[2]: *** [net/core/skbuff.o] Error 1
make[1]: *** [net/core] Error 2
make: *** [net] Error 2

CONFIG_SECURITY_CAPABILITIES=y
# CONFIG_CRYPTO is not set

Linux razor 2.5.46 #1 Fri Nov 8 17:34:37 EST 2002 i686 Pentium II
(Klamath) GenuineIntel GNU/Linux

Gnu C                  2.95.4
Gnu make               3.79.1
util-linux             2.11n
mount                  2.11n
modutils               2.4.19
e2fsprogs              1.30-WIP
Linux C Library        2.2.5
Dynamic linker (ldd)   2.2.5
Procps                 2.0.7
Net-tools              1.60
Console-tools          0.2.3
Sh-utils               4.5.2

--

Linux: the "grim reaper of innocent orphaned children."
          from /usr/src/linux-2.4.18/init/main.c:461

-
To unsubscribe from this list: send the line "unsubscribe linux-kernel" in

More majordomo info at  http://vger.kernel.org/majordomo-info.html
Please read the FAQ at  http://www.tux.org/lkml/

2. Apache: forwarding configuration

3. Linux 2.5.47 compile error

4. XMetro config pbs

5. 2.5.47 RadeonFB compile error

6. Linux findet mein modem nicht

7. 2.5.47 "DAC960" Compile Error

8. Korn93 - package make

9. 2.5.47 ipv4 netfilter compile time error

10. cs46xx compile error 2.5.47

11. 2.5.47-bk compile errors: smbfs, cifs, nfs4, gameport, bttv

12. 2.5.47 : fs/nfsd/nfs4proc.c compile error

13. : Compile error on 2.5.47 with TCPMSS support enabled