2.5.43 : drivers/ieee1394/sbp2.c compile error

2.5.43 : drivers/ieee1394/sbp2.c compile error

Post by Frank Davi » Sun, 20 Oct 2002 03:20:07



Hello all,
  While 'make modules', I received the following error.
Regards,
Frank

drivers/ieee1394/sbp2.c:1516: conflicting types for `sbp2_handle_physdma_write'
drivers/ieee1394/sbp2.h:513: previous declaration of `sbp2_handle_physdma_write'
drivers/ieee1394/sbp2.c:1532: conflicting types for `sbp2_handle_physdma_read'
drivers/ieee1394/sbp2.h:515: previous declaration of `sbp2_handle_physdma_read'
make[2]: *** [drivers/ieee1394/sbp2.o] Error 1
make[1]: *** [drivers/ieee1394] Error 2
make: *** [drivers] Error 2

-
To unsubscribe from this list: send the line "unsubscribe linux-kernel" in

More majordomo info at  http://vger.kernel.org/majordomo-info.html
Please read the FAQ at  http://www.tux.org/lkml/

 
 
 

1. 2.5.43 : net/ipv4/ip_forward.c compile error

Hello all,
  I haven't seen this posted on l-k yet (If I missed it, sorry in
advance). While a 'make bzImage' on 2.5.43, I received the following
error.

Regards,
Frank

net/ipv4/ip_forward.c: In function `ip_forward_finish':
net/ipv4/ip_forward.c:56: structure has no member named `key'
net/ipv4/ip_forward.c:56: structure has no member named `key'
make[2]: *** [net/ipv4/ip_forward.o] Error 1
make[1]: *** [net/ipv4] Error 2
make: *** [net] Error 2

-
To unsubscribe from this list: send the line "unsubscribe linux-kernel" in

More majordomo info at  http://vger.kernel.org/majordomo-info.html
Please read the FAQ at  http://www.tux.org/lkml/

2. re-installing solaris systems from backup.

3. GDT Driver won't compile with 2.5.43

4. Problems mounting CDROM (SBPRO) Linux 1.2.8

5. 2.5.43 futex, error in error path

6. segmentation error

7. AFS compile breakage in 2.5.43

8. Home Linux Workstation Hardware...If you could, what you would.

9. 2.5.43: cpqarray compile fix

10. Problems in the sk98lin driver (2.5.43)

11. i2c-elektor (2.5.43) non-fatal error: unresolved symbol cli, sti

12. 2.5.43 oops in adaptec driver

13. XFS build error on m68k in 2.5.43