bk current build failures (xfrm.h / tpqic02.c)

bk current build failures (xfrm.h / tpqic02.c)

Post by Kevin Brosiu » Fri, 15 Nov 2002 02:40:15



I see the two attached build failures with bk current.

--
Kevin

[ bk_current_bf < 1K ]
net/core/skbuff.c: At top level:
include/net/xfrm.h:104: storage size of `lft' isn't known
include/net/xfrm.h:112: storage size of `replay' isn't known
include/net/xfrm.h:115: storage size of `stats' isn't known
include/net/xfrm.h:117: storage size of `curlft' isn't known
make[2]: *** [net/core/skbuff.o] Error 1

drivers/char/tpqic02.c: In function `__initfn':
drivers/char/tpqic02.c:2798: parse error before "void"
make[2]: *** [drivers/char/tpqic02.o] Error 1

 
 
 

bk current build failures (xfrm.h / tpqic02.c)

Post by David S. Mille » Fri, 15 Nov 2002 06:10:07



> net/core/skbuff.c: At top level:
> include/net/xfrm.h:104: storage size of `lft' isn't known
> include/net/xfrm.h:112: storage size of `replay' isn't known
> include/net/xfrm.h:115: storage size of `stats' isn't known
> include/net/xfrm.h:117: storage size of `curlft' isn't known
> make[2]: *** [net/core/skbuff.o] Error 1

Something is wrong with your tree, net/xfrm.h includes linux/xfrm.h
which declares the layout of said structures the compiler is
complaining about.

-
To unsubscribe from this list: send the line "unsubscribe linux-kernel" in

More majordomo info at  http://vger.kernel.org/majordomo-info.html
Please read the FAQ at  http://www.tux.org/lkml/

 
 
 

bk current build failures (xfrm.h / tpqic02.c)

Post by Jens Axbo » Fri, 15 Nov 2002 14:40:09




> > net/core/skbuff.c: At top level:
> > include/net/xfrm.h:104: storage size of `lft' isn't known
> > include/net/xfrm.h:112: storage size of `replay' isn't known
> > include/net/xfrm.h:115: storage size of `stats' isn't known
> > include/net/xfrm.h:117: storage size of `curlft' isn't known
> > make[2]: *** [net/core/skbuff.o] Error 1

> Something is wrong with your tree, net/xfrm.h includes linux/xfrm.h
> which declares the layout of said structures the compiler is
> complaining about.

Most likely he is building out of his bk tree and he forgot to bk get
the files again.

--
Jens Axboe

-
To unsubscribe from this list: send the line "unsubscribe linux-kernel" in

More majordomo info at  http://vger.kernel.org/majordomo-info.html
Please read the FAQ at  http://www.tux.org/lkml/

 
 
 

bk current build failures (xfrm.h / tpqic02.c)

Post by Kevin Brosiu » Sat, 16 Nov 2002 05:20:06





> > > net/core/skbuff.c: At top level:
> > > include/net/xfrm.h:104: storage size of `lft' isn't known
> > > include/net/xfrm.h:112: storage size of `replay' isn't known
> > > include/net/xfrm.h:115: storage size of `stats' isn't known
> > > include/net/xfrm.h:117: storage size of `curlft' isn't known
> > > make[2]: *** [net/core/skbuff.o] Error 1

> > Something is wrong with your tree, net/xfrm.h includes linux/xfrm.h
> > which declares the layout of said structures the compiler is
> > complaining about.

> Most likely he is building out of his bk tree and he forgot to bk get
> the files again.

Yes, that's it.  Thank you, and sorry about that.  (I'll go configure
for checkout-get mode now...)

Now I see:
drivers/char/tpqic02.c: In function `__initfn':
drivers/char/tpqic02.c:2798: parse error before "void"
make[2]: *** [drivers/char/tpqic02.o] Error 1

I'm guessing that may be fixed in 2.5.47-ac2[&4]?

--
Kevin
-
To unsubscribe from this list: send the line "unsubscribe linux-kernel" in

More majordomo info at  http://vger.kernel.org/majordomo-info.html
Please read the FAQ at  http://www.tux.org/lkml/

 
 
 

1. bk current - new module build failures

The attached module build failures are new since 2.5.46...

--
Kevin

[ bk_current_be < 1K ]
drivers/net/depca.c:2048: redefinition of `__module_name'
drivers/net/depca.c:469: `__module_name' previously defined here
{standard input}: Assembler messages:
{standard input}:3772: Error: symbol `__module_name' is already defined
make[2]: *** [drivers/net/depca.o] Error 1

net/wanrouter/wanmain.c:224: redefinition of `__module_name'
net/wanrouter/wanmain.c:130: `__module_name' previously defined here
{standard input}: Assembler messages:
{standard input}:43: Error: symbol `__module_name' is already defined
make[2]: *** [net/wanrouter/wanmain.o] Error 1

2. Problem compiling Samba 1.9.18p2

3. Latest bk build error in xfrm.h

4. IPChains and DHCP

5. 2.5.48/BK current compile failure

6. Please Help, I can no longer boot!

7. current bk ipmi build fix

8. DNS not working, but host(1) command does. Advice on how to diagnose?

9. BK current compile failure

10. 2.5.39-bk current compile failure

11. hpt366.c cannot be built in current 2.4 bk snapshot

12. current BK boot failure, d_alloc()

13. 2.5.61+ (BK current) compile failures