Probs building apache-1.3.12+ssl-1.41

Probs building apache-1.3.12+ssl-1.41

Post by Rich Tee » Wed, 20 Sep 2000 04:00:00



Hi All,

I'm trying to compile/install Apache 1.3.12 with SSL 1.41.  The compilation
seems to go without a hitch, but "make install" gives these errors:

        ./src/helpers/install.sh -c -m 755 ./src/modules/ssl/apache_ssl.so /opt/local/apache/libexec/apache_ssl.so
        cp: cannot access ./src/modules/ssl/apache_ssl.so
        chmod: WARNING: can't access /opt/local/apache/libexec/inst.19130
        mv: cannot access /opt/local/apache/libexec/inst.19130
        <=== [programs]

Here's a directory listing of src/modules/ssl:


        total 2468
        drwxr-xr-x   2 richteer user         512 Sep 19 14:18 .
        drwxr-xr-x   9 richteer user         512 Sep 19 14:15 ..
        -rw-r--r--   1 richteer user        4755 Sep 19 14:15 Makefile
        -rw-------   1 richteer user         252 Jun 16  1998 Makefile.libdir
        -rw-------   1 richteer user        3077 May  6 16:58 Makefile.tmpl
        -rw-------   1 richteer user       59154 Jun  2 06:13 apache_ssl.c
        -rw-r--r--   1 richteer user       43396 Sep 19 14:18 apache_ssl.lo
        -rwxr-xr-x   1 richteer user       27340 Sep 19 14:18 gcache
        -rw-------   1 richteer user        6497 Jan 16  1999 gcache.c
        -rw-r--r--   1 richteer user        5176 Sep 19 14:18 gcache.o
        -rw-------   1 richteer user        4619 Feb 20  1999 gcacheclient.c
        -rw-r--r--   1 richteer user        3536 Sep 19 14:18 gcacheclient.lo
        -rw-------   1 richteer user        4766 Sep 23  1998 gcachecommon.c
        -rw-r--r--   1 richteer user        5580 Sep 19 14:18 gcachecommon.lo
        -rw-r--r--   1 richteer user        4860 Sep 19 14:18 gcachecommon.o
        -rwxr-xr-x   1 richteer user     1069880 Sep 19 14:18 libssl.so

I've successfully built & installed the fixed version of OpenSSL 0.9.5a,
ran FixPatch, ran configure, and ran make then make install, as per the
READMEs.  If it helps, I'm trying to install stuff in /opt/local/apache,
rather than the more usual /usr/local/apache - but the error messages
indicate that that's not relevant.

The build environment is Solaris 7 MU 4 on SPARC, recent patches, and
gcc 2.95.2.

Any idea?

Many TIA,

--
Rich Teer

NT tries to do almost everything UNIX does, but fails - miserably.

The use of Windoze cripples the mind; its use should, therefore, be
regarded as a criminal offence.  (With apologies to Edsger W. Dijkstra)

Voice: +1 (250) 979-1638
URL: http://www.rite-online.net

 
 
 

1. apache_1.3.12+ssl_1.41 compilation problems

I am installing apache ssl on my server.

I have already installed OpenSSL 0.9.5a 1 Apr 2000

I have applied the apache_1.3.12+ssl_1.41 Patch on apache_1.3.12.

And I have compilation problems :

      -o httpsd buildmark.o modules.o modules/standard/libstandard.a
modules/ssl/libssl.a main/libmain.a ./os/unix/libos.a ap/libap.a
regex/libregex.a lib/expat-lite/libexpat.a  -lm -lcrypt
-L/usr/local/ssl/lib -lssl -lcrypto
modules/ssl/libssl.a(apache_ssl.o): In function `ReadRandomFiles':
apache_ssl.o(.text+0x267): undefined reference to `RAND_egd_bytes'
collect2: ld returned 1 exit status
make[2]: *** [target_static] Error 1
make[2]: Leaving directory `/home/apache_1.3.12/src'
make[1]: *** [build-std] Error 2
make[1]: Leaving directory `/home/apache_1.3.12'
make: *** [build] Error 2

Can anybody help ??

Christophe

2. IP blocking

3. build apache+mod_ssl-1.3.12+2.6.2

4. where to find apache package ?

5. Problem Adding mod_auth_mysql-2.20 to apache-1.3.12-2.1RS.

6. connecting IBM global network with pppd-2.3

7. filesmatch problem (apache-1.3.12)

8. mars_nwe problems

9. Redirect exceptions (apache-1.3.12)

10. Apache-1.3.12 / Sybase-11.0.3.3 / php-3.0.16

11. Problem with apache-1.3.12-2

12. getting mod_rewrite and caching to work together in apache-1.3.12

13. 2.5.40,41, 41-ac1 no DVD-ROM !!!