problem of compiling apache 1.3.14/17 with mod_auth_mysql

problem of compiling apache 1.3.14/17 with mod_auth_mysql

Post by Wong Ching Kuen Frederic » Sat, 17 Feb 2001 11:26:56

i got this error when i try to compile apache 1.3.14/17 with mod_auth_mysql.
i have no such problem with 1.3.12. can anyone give me some hints?!

the server is a redhat 6.2 intel box. thanks.

===> src/modules/auth_mysql
make[4]: *** No rule to make target `../../include/alloc.h', needed by
`mod_auth_mysql.o'.  Stop.
make[3]: *** [all] Error 1
make[2]: *** [subdirs] Error 1
make[2]: Leaving directory `/usr/local/src/apache_1.3.17/src'
make[1]: *** [build-std] Error 2
make[1]: Leaving directory `/usr/local/src/apache_1.3.17'
make: *** [build] Error 2


1. getting mod_auth_mysql to work with apache 1.3.14 under Mac OS X

Operating System: Mac OS X Public Beta
Apache Version: 1.3.14
MySQL version: 3.23.24-beta
mod_auth_mysql version: both Zeev's ver. 2.20 and Khera variant

Problem Description:
Trying to start apache with loading causes:

% apachectl start
dyld: /usr/sbin/httpd multiple definitions of symbol _strtol
definition of _strtol
/System/Library/Apache/Modules/ definition of _strtol
/usr/sbin/apachectl start: httpd could not be started

Further Analysis:
Seems that mod_auth_mysql links in libmysqlclient.a which contains the
offending duplicate symbol.

I have resigned myself to building some or all of mysql again to get this to
work. Is there a way to just compile the libmysqlclient part? How would I
cleanly go about getting rid of the duplicate symbol?


Brettt Tofel

2. Shuttle 603 and Symbios SCSI

3. Problems compiling mod_rewrite on apache 1.3.14

4. IDE CD-ROM compatibility survey

5. Pb with compiling Apache 1.3.14

6. gnuemacs on rts running aix 2.2.1 and X11

7. compiling mod_jk with apache 1.3.14 on solaris 8-sparc

8. AIX 3 single user boot questions

9. Problems compiling 1.3.14

10. Apache 1.3.14 / Netware Perl/CGI PROBLEM, Please help!

11. PDF problems with Apache 1.3.14

12. apache 1.3.14 - rewrite problem?

13. Apache SCRIPT_NAME problem after upgrade 1.3.14 - 1.3.22