NYS 0.27.4 Compile Problems - help

NYS 0.27.4 Compile Problems - help

Post by Bill Wo » Mon, 08 Jul 1996 04:00:00



I'm trying install NYS in a newly installed Slackware 3.0 system, running
kernel 1.3.86.  (I found the correct adaptech 2940uw bootdisk.  Thanks
all)

When I do a make, I get the following:

cd yp  ; make CC="gcc" GCOPTS="-O6 -Wall" RPCLIB="" AR="ar"
RANLIB="ranlib"
AS=
"as" RM="rm"
make[1]: Entering directory `/root/temp/nys/nys-0.27/yp'
(cd src     ; make CC="gcc" GCOPTS="-O6 -Wall" RPCLIB="" AR="ar"
RANLIB="ranlib
" AS="as" RM="rm")
make[2]: Entering directory `/root/temp/nys/nys-0.27/yp/src'
gcc -S -O6 -Wall -I. -I../include -I../../config -c yp_conf.c -o
yp_conf.s
make[2]: *** [yp_conf.o] Error 126
make[2]: Leaving directory `/root/temp/nys/nys-0.27/yp/src'
make[1]: *** [all] Error 2
make[1]: Leaving directory `/root/temp/nys/nys-0.27/yp'
make: *** [libnsl] Error 2
floyd:~/temp/nys/nys-0.27#    

Does anyone have any ideas, or suggestions as to what to do?  Being that
I'm
not a programmer, I'm lost.  :(

Thanks!


 
 
 

1. Help needed to compile libc-4.6.27 with nys-0.27

 I'm trying to compile libc 4.6.27 in a.out with the nys library
(nys-0.27.4.tar.gz). But the compilation fails, saying :

make[1]: Entering directory `/usr/local/src/libc-linux/jump'
makeing lib in libc-nys
make[2]: Entering directory `/usr/local/src/libc-linux/jump/libc-nys'
(cd ../..; for l in *.a; do \
  /usr/bin/ar -d $l __.SYMDEF; \
  /usr/bin/ranlib $l; done)
(/usr/bin/ar -d ../../shared/libcompat/libcompat.a __.SYMDEF; \
 /usr/bin/ranlib ../../shared/libcompat/libcompat.a; )
(cd ../../shared; for l in *.a; do \
  /usr/bin/ar -d $l __.SYMDEF; \
  /usr/bin/ranlib $l; done)
/usr/bin/mkimage -l libc -v 4.6.27 -a 0x60000000 \
        -d 0x60090000 -j 0x00004000  -g 0x00001000 \
        -- ../../shared/libc.a ../../shared/libcurses-old.a ../../shared/libtermcap.a ../../shared/libgdbm.a ../../shared/libgcc/libgcc3.a
../../shared/libcompat/libcompat.a ../../libalias.a
Warning - non-absolute pathname specified for library
../../jump/libc-nys/__jump.o(.text+0x1259): undefined reference to
`crypt__LOCAL__'
../../jump/libc-nys/__jump.o(.text+0x1329): undefined reference to
`encrypt__LOCAL__'
../../jump/libc-nys/__jump.o(.text+0x1c41): undefined reference to
`setkey__LOCAL__'
../../jump/libc-nys/__jump.o(.text+0x21c9): undefined reference to
`fcrypt__LOCAL__'
../../jump/libc-nys/__jump.o(.text+0x21e9): undefined reference to
`init_des__LOCAL__'
system: No such file or directory

/usr/bin/mkimage: error running 'ld -x -Ttext 5ffff000 -Tdata 6008f000
-o libc.so.4.6.27 ../../jump/libc-nys/__jump.o ../../shared/libc.a
../../shared/libcurses-old.a ../../shared/libtermcap.a
../../shared/libgdbm.a ../../shared/libgcc/libgcc3.a
../../shared/libcompat/libcompat.a ../../libalias.a'

mkimage v2.16
Reading configuration files from ../../jump/libc-nys
executing:ld -x -Ttext 5ffff000 -Tdata 6008f000 -o libc.so.4.6.27
../../jump/libc-nys/__jump.o ../../shared/libc.a
../../shared/libcurses-old.a ../../shared/libtermcap.a
../../shared/libgdbm.a ../../shared/libgcc/libgcc3.a
../../shared/libcompat/libcompat.a ../../libalias.a
make[2]: *** [lib] Error 1

 I need to compile this in a.out. Could anyone help, I need the NIS
support urgently. Thanks.
 I'd prefer replies by email of possible, reading the news with my
slow link is not very easy.

    Farzad,

2. PoPToP + NIS and MAYBE nt auth

3. Help Compiling Apache 1.2.0 on Linux 2.0.27 == Help VirtualHost Cgi Directory

4. Need Help w/ PPP and 2.0.23

5. libc 4.6.27 and NYS: help

6. Laserwriter setup - odd behaviour with lpr

7. HELP! compiling 2.0.27

8. Linux and Kali

9. compiling 2.0.27 Kernel : Help

10. Problem Compiling Apache SSL on LinuX 2.0.27

11. Problem compiling kernel 2.0.27

12. Problem: Cant compile new libc.so.x.y.z / NYS Problem

13. libg++.so.27 and libstc++.so.27?